Reaction Details
TargetAdenosine receptor A2b
LigandBDBM50229885
Substrate/Competitorn/a
Meas. Tech.ChEMBL_520168 (CHEMBL947856)
Kd 1.65±n/a nM
Citation Borrmann, THinz, SBertarelli, DCLi, WFlorin, NCScheiff, ABMüller, CE 1-alkyl-8-(piperazine-1-sulfonyl)phenylxanthines: development and characterization of adenosine A2B receptor antagonists and a new radioligand with subnanomolar affinity and subtype specificity. J Med Chem52:3994-4006 (2009) 
 
Adenosine receptor A2b
Name:Adenosine receptor A2b
Type:G Protein-Coupled Receptor (GPCR)
Mol. Mass.:36341.22
Organism:Homo sapiens (Human)
Description:n/a
Residue:332
BDBM50229885
NameBDBM50229885
Synonyms:CHEMBL260331 N-(benzo[d][1,3]dioxol-5-yl)-2-(5-(2,6-dioxo-1,3-dipropyl-2,3,6,7-tetrahydro-1H-purin-8-yl)-1-methyl-1H-pyrazol-3-yloxy)acetamide | N-Benzo[1,3]dioxol-5-yl-2-[5-(2,6-dioxo-1,3-dipropyl-2,3,6,7-tetrahydro-1H-purin-8-yl)-1-methyl-1H-pyrazol-3-yloxy]-acetamide
TypeSmall organic molecule
Emp. Form.C24H27N7O6
Mol. Mass.509.5145
SMILESCCCn1c2nc([nH]c2c(=O)n(CCC)c1=O)-c1cc(OCC(=O)Nc2ccc3OCOc3c2)nn1C