Reaction Details
TargetAdenosine receptor A2b
LigandBDBM50268107
Substrate/Competitorn/a
Meas. Tech.ChEMBL_520168 (CHEMBL947856)
Kd 0.17±n/a nM
Citation Borrmann, THinz, SBertarelli, DCLi, WFlorin, NCScheiff, ABMüller, CE 1-alkyl-8-(piperazine-1-sulfonyl)phenylxanthines: development and characterization of adenosine A2B receptor antagonists and a new radioligand with subnanomolar affinity and subtype specificity. J Med Chem52:3994-4006 (2009) 
 
Adenosine receptor A2b
Name:Adenosine receptor A2b
Type:G Protein-Coupled Receptor (GPCR)
Mol. Mass.:36341.22
Organism:Homo sapiens (Human)
Description:n/a
Residue:332
BDBM50268107
NameBDBM50268107
Synonyms:CHEMBL485862 N-(2-(2-phenyl-6-(4-(3-phenylpropyl)piperazine-1-carbonyl)-7H-pyrrolo[2,3-d]pyrimidin-4-ylamino)ethyl)acetamide | OSIP-339391
TypeSmall organic molecule
Emp. Form.C30H35N7O2
Mol. Mass.525.6446
SMILESCC(=O)NCCNc1nc(nc2[nH]c(cc12)C(=O)N1CCN(CCCc2ccccc2)CC1)-c1ccccc1