Reaction Details
TargetAdenosine receptor A2b
LigandBDBM50268231
Substrate/Competitorn/a
Meas. Tech.ChEMBL_520180 (CHEMBL948832)
Ki 0.406±n/a nM
Citation Borrmann, THinz, SBertarelli, DCLi, WFlorin, NCScheiff, ABMüller, CE 1-alkyl-8-(piperazine-1-sulfonyl)phenylxanthines: development and characterization of adenosine A2B receptor antagonists and a new radioligand with subnanomolar affinity and subtype specificity. J Med Chem52:3994-4006 (2009) 
 
Adenosine receptor A2b
Name:Adenosine receptor A2b
Type:G Protein-Coupled Receptor (GPCR)
Mol. Mass.:36341.22
Organism:Homo sapiens (Human)
Description:n/a
Residue:332
BDBM50268231
NameBDBM50268231
Synonyms:8-(4-(4-(4-Chlorophenyl)piperazine-1-sulfonyl)phenyl)-1-ethyl-3,7-dihydropurine-2,6-dione | CHEMBL483487
TypeSmall organic molecule
Emp. Form.C23H23ClN6O4S
Mol. Mass.514.985
SMILESCCn1c(=O)[nH]c2nc([nH]c2c1=O)-c1ccc(cc1)S(=O)(=O)N1CCN(CC1)c1ccc(Cl)cc1