Reaction Details
TargetAdenosine receptor A2b
LigandBDBM50268245
Substrate/Competitorn/a
Meas. Tech.ChEMBL_520180 (CHEMBL948832)
Ki 1.99±n/a nM
Citation Borrmann, THinz, SBertarelli, DCLi, WFlorin, NCScheiff, ABMüller, CE 1-alkyl-8-(piperazine-1-sulfonyl)phenylxanthines: development and characterization of adenosine A2B receptor antagonists and a new radioligand with subnanomolar affinity and subtype specificity. J Med Chem52:3994-4006 (2009) 
 
Adenosine receptor A2b
Name:Adenosine receptor A2b
Type:G Protein-Coupled Receptor (GPCR)
Mol. Mass.:36341.22
Organism:Homo sapiens (Human)
Description:n/a
Residue:332
BDBM50268245
NameBDBM50268245
Synonyms:8-(4-(4-(4-Methoxyphenyl)piperazine-1-sulfonyl)phenyl)-1-propyl-3,7-dihydropurine-2,6-dione | CHEMBL486481
TypeSmall organic molecule
Emp. Form.C25H28N6O5S
Mol. Mass.524.592
SMILESCCCn1c(=O)[nH]c2nc([nH]c2c1=O)-c1ccc(cc1)S(=O)(=O)N1CCN(CC1)c1ccc(OC)cc1