Reaction Details
TargetClass A beta-lactamase BCL-1
LigandBDBM50021954
Substrate/Competitorn/a
Meas. Tech.ChEMBL_521247 (CHEMBL1002558)
IC50 75±n/a nM
Citation Girlich, DLeclercq, RNaas, TNordmann, P Molecular and biochemical characterization of the chromosome-encoded class A beta-lactamase BCL-1 from Bacillus clausii. Antimicrob Agents Chemother51:4009-14 (2007) 
 
Class A beta-lactamase BCL-1
Name:Class A beta-lactamase BCL-1
Synonyms:Beta-lactamase
Type:PROTEIN
Mol. Mass.:33479.14
Organism:Bacillus clausii
Description:ChEMBL_521247
Residue:307
BDBM50021954
NameBDBM50021954
TypeSmall organic molecule
Emp. Form.C8H11NO5S
Mol. Mass.233.242
SMILESCC1(C)[C@@H](N2[C@@H](CC2=O)S1(=O)=O)C(O)=O