Reaction Details
TargetPotassium voltage-gated channel subfamily H member 2
LigandBDBM50099273
Substrate/Competitorn/a
Meas. Tech.ChEMBL_545772 (CHEMBL1027667)
Ki 4000±n/a nM
Citation Zachariae, UGiordanetto, FLeach, AG Side chain flexibilities in the human ether-a-go-go related gene potassium channel (hERG) together with matched-pair binding studies suggest a new binding mode for channel blockers. J Med Chem52:4266-76 (2009) 
 
Potassium voltage-gated channel subfamily H member 2
Name:Potassium voltage-gated channel subfamily H member 2
Type:Multi-pass membrane protein
Mol. Mass.:126672.65
Organism:Homo sapiens (Human)
Description:Q12809
Residue:1159
BDBM50099273
NameBDBM50099273
Synonyms:6-Fluoro-3-(4-fluoro-piperidin-3-yl)-2-phenyl-1H-indole | CHEMBL288856
TypeSmall organic molecule
Emp. Form.C19H18F2N2
Mol. Mass.312.3564
SMILESF[C@@H]1CCNCC1c1c([nH]c2cc(F)ccc12)-c1ccccc1