Reaction Details
TargetPotassium voltage-gated channel subfamily H member 2
LigandBDBM50108696
Substrate/Competitorn/a
Meas. Tech.ChEMBL_545772 (CHEMBL1027667)
Ki 7143.01±n/a nM
Citation Zachariae, UGiordanetto, FLeach, AG Side chain flexibilities in the human ether-a-go-go related gene potassium channel (hERG) together with matched-pair binding studies suggest a new binding mode for channel blockers. J Med Chem52:4266-76 (2009) 
 
Potassium voltage-gated channel subfamily H member 2
Name:Potassium voltage-gated channel subfamily H member 2
Type:Multi-pass membrane protein
Mol. Mass.:126672.65
Organism:Homo sapiens (Human)
Description:Q12809
Residue:1159
BDBM50108696
NameBDBM50108696
Synonyms:3-[[1-(2-(2,4-Difluorophenyl)ethyl)-4-piperidinyl]sulfonyl]benzamide CHEMBL146485
TypeSmall organic molecule
Emp. Form.C20H22F2N2O3S
Mol. Mass.408.462
SMILESNC(=O)c1cccc(c1)S(=O)(=O)C1CCN(CCc2ccc(F)cc2F)CC1