Reaction Details
TargetPotassium voltage-gated channel subfamily H member 2
LigandBDBM50108700
Substrate/Competitorn/a
Meas. Tech.ChEMBL_545772 (CHEMBL1027667)
Ki 20±n/a nM
Citation Zachariae, UGiordanetto, FLeach, AG Side chain flexibilities in the human ether-a-go-go related gene potassium channel (hERG) together with matched-pair binding studies suggest a new binding mode for channel blockers. J Med Chem52:4266-76 (2009) 
 
Potassium voltage-gated channel subfamily H member 2
Name:Potassium voltage-gated channel subfamily H member 2
Type:Multi-pass membrane protein
Mol. Mass.:126672.65
Organism:Homo sapiens (Human)
Description:Q12809
Residue:1159
BDBM50108700
NameBDBM50108700
Synonyms:1'-(2,4-difluorophenethyl)-6-methoxyspiro[3,4-dihydro-2H-chromene-2,4'-(hexahydropyridine)] CHEMBL146233
TypeSmall organic molecule
Emp. Form.C22H25F2NO2
Mol. Mass.373.4362
SMILESCOc1ccc2OC3(CCN(CCc4ccc(F)cc4F)CC3)CCc2c1