Reaction Details
TargetPotassium voltage-gated channel subfamily H member 2
LigandBDBM50108698
Substrate/Competitorn/a
Meas. Tech.ChEMBL_545772 (CHEMBL1027667)
Ki 69±n/a nM
Citation Zachariae, UGiordanetto, FLeach, AG Side chain flexibilities in the human ether-a-go-go related gene potassium channel (hERG) together with matched-pair binding studies suggest a new binding mode for channel blockers. J Med Chem52:4266-76 (2009) 
 
Potassium voltage-gated channel subfamily H member 2
Name:Potassium voltage-gated channel subfamily H member 2
Type:Multi-pass membrane protein
Mol. Mass.:126672.65
Organism:Homo sapiens (Human)
Description:Q12809
Residue:1159
BDBM50108698
NameBDBM50108698
Synonyms:1'-(2,4-difluorophenethyl)spiro[1,2,3,4-tetrahydronaphthalene-2,4'-(hexahydropyridine)] CHEMBL150210
TypeSmall organic molecule
Emp. Form.C22H25F2N
Mol. Mass.341.4374
SMILESFc1ccc(CCN2CCC3(CC2)CCc2ccccc2C3)c(F)c1