Reaction Details
TargetNeuronal acetylcholine receptor subunit alpha-7
LigandBDBM50278909
Substrate/Competitorn/a
Meas. Tech.ChEMBL_546019 (CHEMBL1028497)
Ki 340±n/a nM
Citation Bunnelle, WHTietje, KRFrost, JMPeters, DJi, JLi, TScanio, MJShi, LAnderson, DJDyhring, TGrønlien, JHWeen, HThorin-Hagene, KMeyer, MD Octahydropyrrolo[3,4-c]pyrrole: a diamine scaffold for construction of either alpha4beta2 or alpha7-selective nicotinic acetylcholine receptor (nAChR) ligands. Substitutions that switch subtype selectivity. J Med Chem52:4126-41 (2009) 
 
Neuronal acetylcholine receptor subunit alpha-7
Name:Neuronal acetylcholine receptor subunit alpha-7
Type:Enzyme
Mol. Mass.:56502.44
Organism:Rattus norvegicus (Rat)
Description:Q05941
Residue:502
BDBM50278909
NameBDBM50278909
Synonyms:CHEMBL496700 | cis-5-(6-Chloropyridin-3-yl)-2,2-dimethyloctahydropyrrolo[3,4-c]-pyrrol-2-ium Iodide
TypeSmall organic molecule
Emp. Form.C13H19ClN3
Mol. Mass.252.763
SMILESC[N+]1(C)C[C@@H]2CN(C[C@@H]2C1)c1ccc(Cl)nc1