Reaction Details
TargetNeuronal acetylcholine receptor subunit alpha-7
LigandBDBM50279370
Substrate/Competitorn/a
Meas. Tech.ChEMBL_546019 (CHEMBL1028497)
Ki 1590±n/a nM
Citation Bunnelle, WHTietje, KRFrost, JMPeters, DJi, JLi, TScanio, MJShi, LAnderson, DJDyhring, TGrønlien, JHWeen, HThorin-Hagene, KMeyer, MD Octahydropyrrolo[3,4-c]pyrrole: a diamine scaffold for construction of either alpha4beta2 or alpha7-selective nicotinic acetylcholine receptor (nAChR) ligands. Substitutions that switch subtype selectivity. J Med Chem52:4126-41 (2009) 
 
Neuronal acetylcholine receptor subunit alpha-7
Name:Neuronal acetylcholine receptor subunit alpha-7
Type:Enzyme
Mol. Mass.:56502.44
Organism:Rattus norvegicus (Rat)
Description:Q05941
Residue:502
BDBM50279370
NameBDBM50279370
Synonyms:CHEMBL484154 | cis-2-Methyl-5-(3-pyridinyl)octahydropyrrolo[3,4-c]pyrrole Dihydrochloride
TypeSmall organic molecule
Emp. Form.C12H17N3
Mol. Mass.203.2835
SMILESCN1C[C@H]2CN(C[C@H]2C1)c1cccnc1