Reaction Details
TargetNeuronal acetylcholine receptor subunit alpha-7
LigandBDBM50279405
Substrate/Competitorn/a
Meas. Tech.ChEMBL_546019 (CHEMBL1028497)
Ki>10000±n/a nM
Citation Bunnelle, WHTietje, KRFrost, JMPeters, DJi, JLi, TScanio, MJShi, LAnderson, DJDyhring, TGrønlien, JHWeen, HThorin-Hagene, KMeyer, MD Octahydropyrrolo[3,4-c]pyrrole: a diamine scaffold for construction of either alpha4beta2 or alpha7-selective nicotinic acetylcholine receptor (nAChR) ligands. Substitutions that switch subtype selectivity. J Med Chem52:4126-41 (2009) 
 
Neuronal acetylcholine receptor subunit alpha-7
Name:Neuronal acetylcholine receptor subunit alpha-7
Type:Enzyme
Mol. Mass.:56502.44
Organism:Rattus norvegicus (Rat)
Description:Q05941
Residue:502
BDBM50279405
NameBDBM50279405
Synonyms:CHEMBL488772 | cis-3-(5-Propyloxy-3-pyridinyl)-3,7-diazabicyclo[3.3.0]octane Semifumarate
TypeSmall organic molecule
Emp. Form.C14H21N3O
Mol. Mass.247.336
SMILESCCCOc1cncc(c1)N1C[C@@H]2CNC[C@@H]2C1