Reaction Details
TargetNeuronal acetylcholine receptor subunit alpha-4
LigandBDBM50279404
Substrate/Competitorn/a
Meas. Tech.ChEMBL_546021 (CHEMBL1028499)
EC50 370±n/a nM
Citation Bunnelle, WHTietje, KRFrost, JMPeters, DJi, JLi, TScanio, MJShi, LAnderson, DJDyhring, TGrønlien, JHWeen, HThorin-Hagene, KMeyer, MD Octahydropyrrolo[3,4-c]pyrrole: a diamine scaffold for construction of either alpha4beta2 or alpha7-selective nicotinic acetylcholine receptor (nAChR) ligands. Substitutions that switch subtype selectivity. J Med Chem52:4126-41 (2009) 
 
Neuronal acetylcholine receptor subunit alpha-4
Name:Neuronal acetylcholine receptor subunit alpha-4
Type:n/a
Mol. Mass.:69963.49
Organism:Homo sapiens (Human)
Description:NACHRA4
Residue:627
BDBM50279404
NameBDBM50279404
Synonyms:CHEMBL447388 | cis-2-(5-Ethoxy-3-pyridinyl)octahydropyrrolo[3,4-c]pyrrole Dihydrochloride
TypeSmall organic molecule
Emp. Form.C13H19N3O
Mol. Mass.233.3095
SMILESCCOc1cncc(c1)N1C[C@@H]2CNC[C@@H]2C1