Reaction Details
TargetNeuronal acetylcholine receptor subunit alpha-7
LigandBDBM82070
Substrate/Competitorn/a
Meas. Tech.ChEMBL_546023 (CHEMBL1034198)
EC50 91000±n/a nM
Citation Bunnelle, WHTietje, KRFrost, JMPeters, DJi, JLi, TScanio, MJShi, LAnderson, DJDyhring, TGrønlien, JHWeen, HThorin-Hagene, KMeyer, MD Octahydropyrrolo[3,4-c]pyrrole: a diamine scaffold for construction of either alpha4beta2 or alpha7-selective nicotinic acetylcholine receptor (nAChR) ligands. Substitutions that switch subtype selectivity. J Med Chem52:4126-41 (2009) 
 
Neuronal acetylcholine receptor subunit alpha-7
Name:Neuronal acetylcholine receptor subunit alpha-7
Type:n/a
Mol. Mass.:56448.33
Organism:Homo sapiens (Human)
Description: CHRNA7 (NACHRA7)
Residue:502
BDBM82070
NameBDBM82070
Synonyms:CAS_29790-52-1 Nicotine-D salicylate US9303017, Nicotine
Typen/a
Emp. Form.C10H14N2
Mol. Mass.162.2316
SMILESCN1CCC[C@H]1c1cccnc1