Reaction Details
TargetNeuronal acetylcholine receptor subunit alpha-4
LigandBDBM50278878
Substrate/Competitorn/a
Meas. Tech.ChEMBL_546018 (CHEMBL1028496)
Ki 0.051±n/a nM
Citation Bunnelle, WHTietje, KRFrost, JMPeters, DJi, JLi, TScanio, MJShi, LAnderson, DJDyhring, TGrønlien, JHWeen, HThorin-Hagene, KMeyer, MD Octahydropyrrolo[3,4-c]pyrrole: a diamine scaffold for construction of either alpha4beta2 or alpha7-selective nicotinic acetylcholine receptor (nAChR) ligands. Substitutions that switch subtype selectivity. J Med Chem52:4126-41 (2009) 
 
Neuronal acetylcholine receptor subunit alpha-4
Name:Neuronal acetylcholine receptor subunit alpha-4
Type:Enzyme
Mol. Mass.:70196.44
Organism:Rattus norvegicus (Rat)
Description:P09483
Residue:630
BDBM50278878
NameBDBM50278878
Synonyms:CHEMBL502567 | cis-3-(5-Isopropyloxy-3-pyridinyl)-3,7-diazabicyclo[3.3.0]octane Semi(fumarate)
TypeSmall organic molecule
Emp. Form.C14H21N3O
Mol. Mass.247.336
SMILESCC(C)Oc1cncc(c1)N1C[C@@H]2CNC[C@@H]2C1