Reaction Details
TargetNeuronal acetylcholine receptor subunit alpha-4
LigandBDBM50279403
Substrate/Competitorn/a
Meas. Tech.ChEMBL_546018 (CHEMBL1028496)
Ki 0.081±n/a nM
Citation Bunnelle, WHTietje, KRFrost, JMPeters, DJi, JLi, TScanio, MJShi, LAnderson, DJDyhring, TGrønlien, JHWeen, HThorin-Hagene, KMeyer, MD Octahydropyrrolo[3,4-c]pyrrole: a diamine scaffold for construction of either alpha4beta2 or alpha7-selective nicotinic acetylcholine receptor (nAChR) ligands. Substitutions that switch subtype selectivity. J Med Chem52:4126-41 (2009) 
 
Neuronal acetylcholine receptor subunit alpha-4
Name:Neuronal acetylcholine receptor subunit alpha-4
Type:Enzyme
Mol. Mass.:70196.44
Organism:Rattus norvegicus (Rat)
Description:P09483
Residue:630
BDBM50279403
NameBDBM50279403
Synonyms:CHEMBL486512 | cis-2-(5-Methoxy-3-pyridinyl)octahydropyrrolo[3,4-c]pyrrole Dihydrochloride
TypeSmall organic molecule
Emp. Form.C12H17N3O
Mol. Mass.219.2829
SMILESCOc1cncc(c1)N1C[C@@H]2CNC[C@@H]2C1