Reaction Details
TargetNeuronal acetylcholine receptor subunit alpha-7
LigandBDBM50279059
Substrate/Competitorn/a
Meas. Tech.ChEMBL_546019 (CHEMBL1028497)
Ki 0.24±n/a nM
Citation Bunnelle, WHTietje, KRFrost, JMPeters, DJi, JLi, TScanio, MJShi, LAnderson, DJDyhring, TGrønlien, JHWeen, HThorin-Hagene, KMeyer, MD Octahydropyrrolo[3,4-c]pyrrole: a diamine scaffold for construction of either alpha4beta2 or alpha7-selective nicotinic acetylcholine receptor (nAChR) ligands. Substitutions that switch subtype selectivity. J Med Chem52:4126-41 (2009) 
 
Neuronal acetylcholine receptor subunit alpha-7
Name:Neuronal acetylcholine receptor subunit alpha-7
Type:Enzyme
Mol. Mass.:56502.44
Organism:Rattus norvegicus (Rat)
Description:Q05941
Residue:502
BDBM50279059
NameBDBM50279059
Synonyms:CHEMBL496851 | cis-5-[6-(5-Methyl-hexahydro-pyrrolo[3,4-c]pyrrol-2-yl)-pyridazin-3-yl]-1H-indole Bis-p-toluenesulfonate
TypeSmall organic molecule
Emp. Form.C19H21N5
Mol. Mass.319.4035
SMILESCN1C[C@H]2CN(C[C@H]2C1)c1ccc(nn1)-c1ccc2[nH]ccc2c1