Reaction Details
TargetNeuronal acetylcholine receptor subunit alpha-7
LigandBDBM50278934
Substrate/Competitorn/a
Meas. Tech.ChEMBL_546019 (CHEMBL1028497)
Ki 28±n/a nM
Citation Bunnelle, WHTietje, KRFrost, JMPeters, DJi, JLi, TScanio, MJShi, LAnderson, DJDyhring, TGrønlien, JHWeen, HThorin-Hagene, KMeyer, MD Octahydropyrrolo[3,4-c]pyrrole: a diamine scaffold for construction of either alpha4beta2 or alpha7-selective nicotinic acetylcholine receptor (nAChR) ligands. Substitutions that switch subtype selectivity. J Med Chem52:4126-41 (2009) 
 
Neuronal acetylcholine receptor subunit alpha-7
Name:Neuronal acetylcholine receptor subunit alpha-7
Type:Enzyme
Mol. Mass.:56502.44
Organism:Rattus norvegicus (Rat)
Description:Q05941
Residue:502
BDBM50278934
NameBDBM50278934
Synonyms:CHEMBL497059 | cis-2-Biphenyl-4-yl-octahydro-pyrrolo[3,4-c]pyrrole Trifluoroacetate
TypeSmall organic molecule
Emp. Form.C18H20N2
Mol. Mass.264.3648
SMILESC1NC[C@@H]2CN(C[C@H]12)c1ccc(cc1)-c1ccccc1