Reaction Details
TargetNeuronal acetylcholine receptor subunit alpha-7
LigandBDBM50278991
Substrate/Competitorn/a
Meas. Tech.ChEMBL_546019 (CHEMBL1028497)
Ki 44±n/a nM
Citation Bunnelle, WHTietje, KRFrost, JMPeters, DJi, JLi, TScanio, MJShi, LAnderson, DJDyhring, TGrønlien, JHWeen, HThorin-Hagene, KMeyer, MD Octahydropyrrolo[3,4-c]pyrrole: a diamine scaffold for construction of either alpha4beta2 or alpha7-selective nicotinic acetylcholine receptor (nAChR) ligands. Substitutions that switch subtype selectivity. J Med Chem52:4126-41 (2009) 
 
Neuronal acetylcholine receptor subunit alpha-7
Name:Neuronal acetylcholine receptor subunit alpha-7
Type:Enzyme
Mol. Mass.:56502.44
Organism:Rattus norvegicus (Rat)
Description:Q05941
Residue:502
BDBM50278991
NameBDBM50278991
Synonyms:CHEMBL502022 | cis-2-(6-Biphenyl-3-yl-pyridin-3-yl)-5-methyl-octahydro-pyrrolo[3,4-c]pyrrole p-Toluenesulfonate
TypeSmall organic molecule
Emp. Form.C24H25N3
Mol. Mass.355.4754
SMILESCN1C[C@H]2CN(C[C@H]2C1)c1ccc(nc1)-c1cccc(c1)-c1ccccc1