Reaction Details
TargetSerine/threonine-protein kinase Chk1
LigandBDBM50250137
Substrate/Competitorn/a
Meas. Tech.ChEMBL_498286 (CHEMBL972528)
IC50>50000±n/a nM
Citation Hall, MDSalam, NKHellawell, JLFales, HMKensler, CBLudwig, JASzakács, GHibbs, DEGottesman, MM Synthesis, activity, and pharmacophore development for isatin-beta-thiosemicarbazones with selective activity toward multidrug-resistant cells. J Med Chem52:3191-204 (2009) 
 
Serine/threonine-protein kinase Chk1
Name:Serine/threonine-protein kinase Chk1
Type:Enzyme Catalytic Domain
Mol. Mass.:54443.02
Organism:Homo sapiens (Human)
Description:gi_166295192
Residue:476
BDBM50250137
NameBDBM50250137
Synonyms:1-Isatin-4-(4'methoxyphenyl)thiosemicarbazone NSC-73306
TypeSmall organic molecule
Emp. Form.C16H14N4O2S
Mol. Mass.326.373
SMILESCOc1ccc(NC(=S)NN=C2C(=O)Nc3ccccc23)cc1