Reaction Details
TargetHeat shock protein HSP 90-beta
LigandBDBM50249918
Substrate/Competitorn/a
Meas. Tech.ChEMBL_498597 (CHEMBL1021924)
Kd 2000±n/a nM
Citation Tian, ZQWang, ZMacMillan, KSZhou, YCarreras, CWMueller, TMyles, DCLiu, Y Potent cytotoxic C-11 modified geldanamycin analogues. J Med Chem52:3265-73 (2009) 
 
Heat shock protein HSP 90-beta
Name:Heat shock protein HSP 90-beta
Type:Molecular Chaperone
Mol. Mass.:83229.45
Organism:Homo sapiens (Human)
Description:P08238
Residue:724
BDBM50249918
NameBDBM50249918
Synonyms:(8S,9S,12S,13R,14S,16R)-19-(2-(1H-imidazol-4-yl)ethylamino)-8,13,14-trimethoxy-4,10,12,16-tetramethyl-3,20,22-trioxo-2-azabicyclo[16.3.1]docosa-1(21),4,6,10,18-pentaen-9-yl carbamate | CHEMBL475483
TypeSmall organic molecule
Emp. Form.C34H47N5O8
Mol. Mass.653.7657
SMILESCO[C@H]1C[C@H](C)Cc2c(O)c(NC(=O)C(C)=CC=C[C@H](OC)[C@@H](OC(N)=O)\C(C)=C\[C@H](C)[C@H]1OC)cc(O)c2N=CCc1cnc[nH]1