Reaction Details
TargetP2Y purinoceptor 2
LigandBDBM50118220
Substrate/Competitorn/a
Meas. Tech.ChEMBL_498708 (CHEMBL974435)
EC50 167±n/a nM
Citation Hillmann, PKo, GYSpinrath, ARaulf, Avon Kügelgen, IWolff, SCNicholas, RAKostenis, EHöltje, HDMüller, CE Key determinants of nucleotide-activated G protein-coupled P2Y(2) receptor function revealed by chemical and pharmacological experiments, mutagenesis and homology modeling. J Med Chem52:2762-75 (2009) 
 
P2Y purinoceptor 2
Name:P2Y purinoceptor 2
Type:PROTEIN
Mol. Mass.:42299.21
Organism:Homo sapiens (Human)
Description:ChEMBL_1455361
Residue:377
BDBM50118220
NameBDBM50118220
Synonyms:(ppA)2 CHEMBL339385 adenosine(5')tetraphospho(5')adenosine | bis(5'-adenylyl) diphosphate
TypeSmall organic molecule
Emp. Form.C20H28N10O19P4
Mol. Mass.836.387
SMILESNc1ncnc2n(cnc12)[C@@H]1O[C@H](COP(O)(=O)OP(O)(=O)OP(O)(=O)OP(O)(=O)OC[C@H]2O[C@H]([C@H](O)[C@@H]2O)n2cnc3c(N)ncnc23)[C@@H](O)[C@H]1O