Reaction Details
TargetP2Y purinoceptor 2
LigandBDBM50366480
Substrate/Competitorn/a
Meas. Tech.ChEMBL_498707 (CHEMBL971541)
EC50 95.8±n/a nM
Citation Hillmann, PKo, GYSpinrath, ARaulf, Avon Kügelgen, IWolff, SCNicholas, RAKostenis, EHöltje, HDMüller, CE Key determinants of nucleotide-activated G protein-coupled P2Y(2) receptor function revealed by chemical and pharmacological experiments, mutagenesis and homology modeling. J Med Chem52:2762-75 (2009) 
 
P2Y purinoceptor 2
Name:P2Y purinoceptor 2
Type:PROTEIN
Mol. Mass.:42299.21
Organism:Homo sapiens (Human)
Description:ChEMBL_1455361
Residue:377
BDBM50366480
NameBDBM50366480
Synonyms:ADENOSINE TRIPHOSPHATE | ATP
TypeSmall organic molecule
Emp. Form.C10H16N5O13P3
Mol. Mass.507.181
SMILESNc1ncnc2n(cnc12)[C@@H]1O[C@H](CO[P@](O)(=O)O[P@@](O)(=O)OP(O)(O)=O)[C@@H](O)[C@H]1O