Reaction Details
TargetCalpain-1 catalytic subunit
LigandBDBM50250189
Substrate/Competitorn/a
Meas. Tech.ChEMBL_498764 (CHEMBL1021956)
IC50>30000±n/a nM
Citation Kang, DHJun, KYLee, JPPak, CSNa, YKwon, Y Identification of 3-acetyl-2-aminoquinolin-4-one as a novel, nonpeptidic scaffold for specific calpain inhibitory activity. J Med Chem52:3093-7 (2009) 
 
Calpain-1 catalytic subunit
Name:Calpain-1 catalytic subunit
Type:Protein
Mol. Mass.:81880.51
Organism:Homo sapiens (Human)
Description:n/a
Residue:714
BDBM50250189
NameBDBM50250189
Synonyms:3-acetyl-6-chloro-8-(trifluoromethyl)-2-(4-(trifluoromethyl)phenylamino)quinolin-4(1H)-one | CHEMBL490503
TypeSmall organic molecule
Emp. Form.C19H11ClF6N2O2
Mol. Mass.448.746
SMILESCC(=O)c1c(O)c2cc(Cl)cc(c2nc1Nc1ccc(cc1)C(F)(F)F)C(F)(F)F