Reaction Details
TargetCalpain-1 catalytic subunit
LigandBDBM50250192
Substrate/Competitorn/a
Meas. Tech.ChEMBL_498764 (CHEMBL1021956)
IC50 19200±n/a nM
Citation Kang, DHJun, KYLee, JPPak, CSNa, YKwon, Y Identification of 3-acetyl-2-aminoquinolin-4-one as a novel, nonpeptidic scaffold for specific calpain inhibitory activity. J Med Chem52:3093-7 (2009) 
 
Calpain-1 catalytic subunit
Name:Calpain-1 catalytic subunit
Type:Protein
Mol. Mass.:81880.51
Organism:Homo sapiens (Human)
Description:n/a
Residue:714
BDBM50250192
NameBDBM50250192
Synonyms:3-acetyl-2-(2,4-dichlorophenylamino)-8-(trifluoromethyl)quinolin-4(1H)-one | CHEMBL523140
TypeSmall organic molecule
Emp. Form.C18H11Cl2F3N2O2
Mol. Mass.415.193
SMILESCC(=O)c1c(O)c2cccc(c2nc1Nc1ccc(Cl)cc1Cl)C(F)(F)F