Reaction Details
TargetCalpain-1 catalytic subunit
LigandBDBM50249606
Substrate/Competitorn/a
Meas. Tech.ChEMBL_498764 (CHEMBL1021956)
IC50 3530±n/a nM
Citation Kang, DHJun, KYLee, JPPak, CSNa, YKwon, Y Identification of 3-acetyl-2-aminoquinolin-4-one as a novel, nonpeptidic scaffold for specific calpain inhibitory activity. J Med Chem52:3093-7 (2009) 
 
Calpain-1 catalytic subunit
Name:Calpain-1 catalytic subunit
Type:Protein
Mol. Mass.:81880.51
Organism:Homo sapiens (Human)
Description:n/a
Residue:714
BDBM50249606
NameBDBM50249606
Synonyms:3-acetyl-8-bromo-5-chloro-2-(4-chlorophenylamino)quinolin-4(1H)-one | CHEMBL513042
TypeSmall organic molecule
Emp. Form.C17H11BrCl2N2O2
Mol. Mass.426.091
SMILESCC(=O)c1c(O)c2c(Cl)ccc(Br)c2nc1Nc1ccc(Cl)cc1