Reaction Details
TargetCalpain-1 catalytic subunit
LigandBDBM50249607
Substrate/Competitorn/a
Meas. Tech.ChEMBL_498764 (CHEMBL1021956)
IC50 3990±n/a nM
Citation Kang, DHJun, KYLee, JPPak, CSNa, YKwon, Y Identification of 3-acetyl-2-aminoquinolin-4-one as a novel, nonpeptidic scaffold for specific calpain inhibitory activity. J Med Chem52:3093-7 (2009) 
 
Calpain-1 catalytic subunit
Name:Calpain-1 catalytic subunit
Type:Protein
Mol. Mass.:81880.51
Organism:Homo sapiens (Human)
Description:n/a
Residue:714
BDBM50249607
NameBDBM50249607
Synonyms:3-acetyl-5,8-dichloro-2-(2,4-dichlorophenylamino)quinolin-4(1H)-one | CHEMBL471915
TypeSmall organic molecule
Emp. Form.C17H10Cl4N2O2
Mol. Mass.416.086
SMILESCC(=O)c1c(Nc2ccc(Cl)cc2Cl)nc2c(Cl)ccc(Cl)c2c1O