Reaction Details
TargetCalpain-1 catalytic subunit
LigandBDBM50249659
Substrate/Competitorn/a
Meas. Tech.ChEMBL_498764 (CHEMBL1021956)
IC50 277±n/a nM
Citation Kang, DHJun, KYLee, JPPak, CSNa, YKwon, Y Identification of 3-acetyl-2-aminoquinolin-4-one as a novel, nonpeptidic scaffold for specific calpain inhibitory activity. J Med Chem52:3093-7 (2009) 
 
Calpain-1 catalytic subunit
Name:Calpain-1 catalytic subunit
Type:Protein
Mol. Mass.:81880.51
Organism:Homo sapiens (Human)
Description:n/a
Residue:714
BDBM50249659
NameBDBM50249659
Synonyms:3-acetyl-8-chloro-2-(2,4-dibromophenylamino)-5-methylquinolin-4(1H)-one | CHEMBL523822
TypeSmall organic molecule
Emp. Form.C18H13Br2ClN2O2
Mol. Mass.484.569
SMILESCC(=O)c1c(O)c2c(C)ccc(Cl)c2nc1Nc1ccc(Br)cc1Br