Reaction Details
TargetCalpain-1 catalytic subunit
LigandBDBM50250152
Substrate/Competitorn/a
Meas. Tech.ChEMBL_498765 (CHEMBL1021957)
IC50 8080±n/a nM
Citation Kang, DHJun, KYLee, JPPak, CSNa, YKwon, Y Identification of 3-acetyl-2-aminoquinolin-4-one as a novel, nonpeptidic scaffold for specific calpain inhibitory activity. J Med Chem52:3093-7 (2009) 
 
Calpain-1 catalytic subunit
Name:Calpain-1 catalytic subunit
Type:Protein
Mol. Mass.:81880.51
Organism:Homo sapiens (Human)
Description:n/a
Residue:714
BDBM50250152
NameBDBM50250152
Synonyms:3-acetyl-8-chloro-2-(4-chlorophenylamino)-6-nitroquinolin-4(1H)-one | CHEMBL492175
TypeSmall organic molecule
Emp. Form.C17H11Cl2N3O4
Mol. Mass.392.193
SMILESCC(=O)c1c(Nc2ccc(Cl)cc2)nc2c(Cl)cc(cc2c1O)[N+]([O-])=O