Reaction Details
TargetCalpain-1 catalytic subunit
LigandBDBM50250190
Substrate/Competitorn/a
Meas. Tech.ChEMBL_498765 (CHEMBL1021957)
IC50 2390±n/a nM
Citation Kang, DHJun, KYLee, JPPak, CSNa, YKwon, Y Identification of 3-acetyl-2-aminoquinolin-4-one as a novel, nonpeptidic scaffold for specific calpain inhibitory activity. J Med Chem52:3093-7 (2009) 
 
Calpain-1 catalytic subunit
Name:Calpain-1 catalytic subunit
Type:Protein
Mol. Mass.:81880.51
Organism:Homo sapiens (Human)
Description:n/a
Residue:714
BDBM50250190
NameBDBM50250190
Synonyms:3-acetyl-6-chloro-2-(2-chloro-4-methylphenylamino)-8-nitroquinolin-4(1H)-one | CHEMBL521771
TypeSmall organic molecule
Emp. Form.C18H13Cl2N3O4
Mol. Mass.406.22
SMILESCC(=O)c1c(Nc2ccc(C)cc2Cl)nc2c(cc(Cl)cc2c1O)[N+]([O-])=O