Reaction Details
TargetCathepsin B
LigandBDBM50250152
Substrate/Competitorn/a
Meas. Tech.ChEMBL_498766 (CHEMBL1021958)
IC50 14.20±n/a nM
Citation Kang, DHJun, KYLee, JPPak, CSNa, YKwon, Y Identification of 3-acetyl-2-aminoquinolin-4-one as a novel, nonpeptidic scaffold for specific calpain inhibitory activity. J Med Chem52:3093-7 (2009) 
 
Cathepsin B
Name:Cathepsin B
Type:Enzyme
Mol. Mass.:37819.69
Organism:Homo sapiens (Human)
Description:gi_63102437
Residue:339
BDBM50250152
NameBDBM50250152
Synonyms:3-acetyl-8-chloro-2-(4-chlorophenylamino)-6-nitroquinolin-4(1H)-one | CHEMBL492175
TypeSmall organic molecule
Emp. Form.C17H11Cl2N3O4
Mol. Mass.392.193
SMILESCC(=O)c1c(Nc2ccc(Cl)cc2)nc2c(Cl)cc(cc2c1O)[N+]([O-])=O