Reaction Details
TargetCathepsin B
LigandBDBM50250191
Substrate/Competitorn/a
Meas. Tech.ChEMBL_498766 (CHEMBL1021958)
IC50 12690±n/a nM
Citation Kang, DHJun, KYLee, JPPak, CSNa, YKwon, Y Identification of 3-acetyl-2-aminoquinolin-4-one as a novel, nonpeptidic scaffold for specific calpain inhibitory activity. J Med Chem52:3093-7 (2009) 
 
Cathepsin B
Name:Cathepsin B
Type:Enzyme
Mol. Mass.:37819.69
Organism:Homo sapiens (Human)
Description:gi_63102437
Residue:339
BDBM50250191
NameBDBM50250191
Synonyms:3-acetyl-6-chloro-2-(2,4-dichlorophenylamino)-8-nitroquinolin-4(1H)-one | CHEMBL491348
TypeSmall organic molecule
Emp. Form.C17H10Cl3N3O4
Mol. Mass.426.638
SMILESCC(=O)c1c(Nc2ccc(Cl)cc2Cl)nc2c(cc(Cl)cc2c1O)[N+]([O-])=O