Reaction Details
TargetSodium-dependent noradrenaline transporter
LigandBDBM50010859
Substrate/Competitorn/a
Meas. Tech.ChEMBL_499923 (CHEMBL979833)
IC50 74±n/a nM
Citation Kelly, JXSmilkstein, MJCooper, RALane, KDJohnson, RAJanowsky, ADodean, RAHinrichs, DJWinter, RRiscoe, M Design, synthesis, and evaluation of 10-N-substituted acridones as novel chemosensitizers in Plasmodium falciparum. Antimicrob Agents Chemother51:4133-40 (2007) 
 
Sodium-dependent noradrenaline transporter
Name:Sodium-dependent noradrenaline transporter
Type:Multi-pass membrane protein
Mol. Mass.:69337.72
Organism:Homo sapiens (Human)
Description:P23975
Residue:617
BDBM50010859
NameBDBM50010859
Synonyms:CHEMBL11 IMIPRAMINE PAMOATE | Imipramin
TypeSmall organic molecule
Emp. Form.C19H24N2
Mol. Mass.280.4073
SMILESCN(C)CCCN1c2ccccc2CCc2ccccc12