Reaction Details
TargetPapain
LigandBDBM50378032
Substrate/Competitorn/a
Meas. Tech.ChEMBL_499481 (CHEMBL1021973)
IC50 1900±n/a nM
Citation Martins, FTAssis, DMDos Santos, MHCamps, IVeloso, MPJuliano, MAAlves, LCDoriguetto, AC Natural polyprenylated benzophenones inhibiting cysteine and serine proteases. Eur J Med Chem44:1230-9 (2009) 
 
Papain
Name:Papain
Type:Enzyme
Mol. Mass.:38923.01
Organism:Carica papaya
Description:Papain was purchased from Sigma, Germany.
Residue:345
BDBM50378032
NameBDBM50378032
Synonyms:CHEMBL452483 | Guttiferone A
TypeSmall organic molecule
Emp. Form.C38H50O6
Mol. Mass.602.8
SMILES[#6]\[#6](-[#6])=[#6]/[#6]-[#6][C@]1([#6])[#6@@H](-[#6]\[#6]=[#6](/[#6])-[#6])-[#6][C@@]2([#6]\[#6]=[#6](/[#6])-[#6])[#6](=O)-[#6](-[#6](=O)-c3ccc(-[#8])c(-[#8])c3)-[#6](=O)[C@]1([#6]\[#6]=[#6](/[#6])-[#6])[#6]2=O