Reaction Details
TargetPapain
LigandBDBM50249351
Substrate/Competitorn/a
Meas. Tech.ChEMBL_499481 (CHEMBL1021973)
IC50 19500±n/a nM
Citation Martins, FTAssis, DMDos Santos, MHCamps, IVeloso, MPJuliano, MAAlves, LCDoriguetto, AC Natural polyprenylated benzophenones inhibiting cysteine and serine proteases. Eur J Med Chem44:1230-9 (2009) 
 
Papain
Name:Papain
Type:Enzyme
Mol. Mass.:38923.01
Organism:Carica papaya
Description:Papain was purchased from Sigma, Germany.
Residue:345
BDBM50249351
NameBDBM50249351
Synonyms:CHEMBL470519 | epiclusianone
TypeSmall organic molecule
Emp. Form.C32H40O4
Mol. Mass.488.6576
SMILES[#6]\[#6](-[#6])=[#6]\[#6]-[#6@H]1-[#6][C@@]2([#6]\[#6]=[#6](\[#6])-[#6])[#6](=O)-[#6](-[#6](=O)-c3ccccc3)-[#6](=O)[C@](\[#6]=[#6](/[#6])-[#6])([#6]2=O)C1([#6])[#6]