Reaction Details
TargetSodium-dependent serotonin transporter
LigandBDBM50124566
Substrate/Competitorn/a
Meas. Tech.ChEMBL_500246 (CHEMBL966884)
IC50 242±n/a nM
Citation Vu, ATCohn, STTerefenko, EAMoore, WJZhang, PMahaney, PETrybulski, EJGoljer, IDooley, RBray, JAJohnston, GHLeiter, JDeecher, DC 3-(Arylamino)-3-phenylpropan-2-olamines as a new series of dual norepinephrine and serotonin reuptake inhibitors. Bioorg Med Chem Lett19:2464-7 (2009) 
 
Sodium-dependent serotonin transporter
Name:Sodium-dependent serotonin transporter
Type:Multi-pass membrane protein
Mol. Mass.:70322.51
Organism:Homo sapiens (Human)
Description:P31645
Residue:630
BDBM50124566
NameBDBM50124566
Synonyms:(R)-2-((R)-(2-ethoxyphenoxy)(phenyl)methyl)morpholine 2-((2-ethoxyphenoxy)(phenyl)methyl)morpholine 2-[2-ethoxyphenoxy(phenyl)methyl]-1,4-oxazinane REBOXETINE | rac-syn-2-((2-ethoxyphenoxy)(phenyl)methyl)morpholine
TypeSmall organic molecule
Emp. Form.C19H23NO3
Mol. Mass.313.3908
SMILESCCOc1ccccc1OC(C1CNCCO1)c1ccccc1