Reaction Details
TargetRenin
LigandBDBM50259432
Substrate/Competitorn/a
Meas. Tech.ChEMBL_501174 (CHEMBL975287)
IC50 9.1±n/a nM
Citation Bezençon, OBur, DWeller, TRichard-Bildstein, SRemen, LSifferlen, TCorminboeuf, OGrisostomi, CBoss, CPrade, LDelahaye, STreiber, AStrickner, PBinkert, CHess, PSteiner, BFischli, W Design and preparation of potent, nonpeptidic, bioavailable renin inhibitors. J Med Chem52:3689-702 (2009) 
 
Renin
Name:Renin
Type:Enzyme
Mol. Mass.:45058.99
Organism:Homo sapiens (Human)
Description:n/a
Residue:406
BDBM50259432
NameBDBM50259432
Synonyms:(1R,5S)-3-Acetyl-7-{4-[3-(2-methoxy-benzyloxy)-propoxy]-phenyl}-3,9-diaza-bicyclo[3.3.1]non-6-ene-6-carboxylic acid cyclopropyl-(2,3-dichloro-benzyl)-amide | CHEMBL504443
TypeSmall organic molecule
Emp. Form.C37H41Cl2N3O5
Mol. Mass.678.645
SMILESCOc1ccccc1COCCCOc1ccc(cc1)C1=C([C@H]2CN(C[C@@H](C1)N2)C(C)=O)C(=O)N(Cc1cccc(Cl)c1Cl)C1CC1