Reaction Details
TargetRenin
LigandBDBM50330345
Substrate/Competitorn/a
Meas. Tech.ChEMBL_501175 (CHEMBL975288)
IC50 0.039±n/a nM
Citation Bezençon, OBur, DWeller, TRichard-Bildstein, SRemen, LSifferlen, TCorminboeuf, OGrisostomi, CBoss, CPrade, LDelahaye, STreiber, AStrickner, PBinkert, CHess, PSteiner, BFischli, W Design and preparation of potent, nonpeptidic, bioavailable renin inhibitors. J Med Chem52:3689-702 (2009) 
 
Renin
Name:Renin
Type:Enzyme
Mol. Mass.:45058.99
Organism:Homo sapiens (Human)
Description:n/a
Residue:406
BDBM50330345
NameBDBM50330345
Synonyms:CHEMBL1276275 Ro-66-1168
TypeSmall organic molecule
Emp. Form.C36H47N3O5
Mol. Mass.601.7755
SMILESCOc1ccccc1COCCCOc1ccc(cc1)[C@H]1CCNC[C@@H]1OCc1ccc2CCCN(CCNC(C)=O)c2c1