Reaction Details
TargetRenin
LigandBDBM50259464
Substrate/Competitorn/a
Meas. Tech.ChEMBL_501174 (CHEMBL975287)
IC50 19±n/a nM
Citation Bezençon, OBur, DWeller, TRichard-Bildstein, SRemen, LSifferlen, TCorminboeuf, OGrisostomi, CBoss, CPrade, LDelahaye, STreiber, AStrickner, PBinkert, CHess, PSteiner, BFischli, W Design and preparation of potent, nonpeptidic, bioavailable renin inhibitors. J Med Chem52:3689-702 (2009) 
 
Renin
Name:Renin
Type:Enzyme
Mol. Mass.:45058.99
Organism:Homo sapiens (Human)
Description:n/a
Residue:406
BDBM50259464
NameBDBM50259464
Synonyms:(1R,5S)-7-{4-[2-(2,6-Dichloro-4-methyl-phenoxy)-ethoxy]-phenyl}-3,9-diaza-bicyclo[3.3.1]non-6-ene-6-carboxylic acid cyclopropyl-(2,3-dimethyl-benzyl)-amide | CHEMBL449638
TypeSmall organic molecule
Emp. Form.C37H41Cl2N3O4
Mol. Mass.662.645
SMILESCC(=O)N1C[C@H]2CC(=C([C@@H](C1)N2)C(=O)N(Cc1cccc(C)c1C)C1CC1)c1ccc(OCCOc2c(Cl)cc(C)cc2Cl)cc1