Reaction Details
TargetKappa-type opioid receptor
LigandBDBM50294426
Substrate/Competitorn/a
Meas. Tech.ChEMBL_575379 (CHEMBL1027053)
Ki 0.360000±n/a nM
Citation Nagase, HOsa, YNemoto, TFujii, HImai, MNakamura, TKanemasa, TKato, AGouda, HHirono, S Design and synthesis of novel delta opioid receptor agonists and their pharmacologies. Bioorg Med Chem Lett19:2792-5 (2009) 
 
Kappa-type opioid receptor
Name:Kappa-type opioid receptor
Type:G Protein-Coupled Receptor (GPCR)
Mol. Mass.:42744.99
Organism:Cavia porcellus (domestic guinea pig)
Description:P41144
Residue:380
BDBM50294426
NameBDBM50294426
Synonyms:CHEMBL559518 | SN-11
TypeSmall organic molecule
Emp. Form.C27H28N2O
Mol. Mass.396.524
SMILESOc1ccc2C[C@@H]3[C@@H]4Cc5cc6ccccc6nc5C[C@]4(CCN3CC3CC3)c2c1