Reaction Details
TargetKappa-type opioid receptor
LigandBDBM50294427
Substrate/Competitorn/a
Meas. Tech.ChEMBL_575379 (CHEMBL1027053)
Ki 4.4±n/a nM
Citation Nagase, HOsa, YNemoto, TFujii, HImai, MNakamura, TKanemasa, TKato, AGouda, HHirono, S Design and synthesis of novel delta opioid receptor agonists and their pharmacologies. Bioorg Med Chem Lett19:2792-5 (2009) 
 
Kappa-type opioid receptor
Name:Kappa-type opioid receptor
Type:G Protein-Coupled Receptor (GPCR)
Mol. Mass.:42744.99
Organism:Cavia porcellus (domestic guinea pig)
Description:P41144
Residue:380
BDBM50294427
NameBDBM50294427
Synonyms:CHEMBL564538 | SN-23
TypeSmall organic molecule
Emp. Form.C27H30N2O
Mol. Mass.398.5399
SMILESCC(C)CN1CC[C@]23Cc4nc5ccccc5cc4C[C@H]2[C@H]1Cc1ccc(O)cc31