Reaction Details
TargetTyrosine-protein phosphatase non-receptor type 1
LigandBDBM50294530
Substrate/Competitorn/a
Meas. Tech.ChEMBL_575586 (CHEMBL1036431)
IC50 3020±n/a nM
Citation Seo, CSohn, JHAhn, JSYim, JHLee, HKOh, H Protein tyrosine phosphatase 1B inhibitory effects of depsidone and pseudodepsidone metabolites from the Antarctic lichen Stereocaulon alpinum. Bioorg Med Chem Lett19:2801-3 (2009) 
 
Tyrosine-protein phosphatase non-receptor type 1
Name:Tyrosine-protein phosphatase non-receptor type 1
Type:Protein phosphatase
Mol. Mass.:49963.76
Organism:Homo sapiens (Human)
Description:Human recombinant GST-fusion PTP1B (1-435).
Residue:435
BDBM50294530
NameBDBM50294530
Synonyms:CHEMBL559457 | methyl 8-hydroxy-3-methoxy-11-oxo-1-pentanoyl-6-pentyl-11H-dibenzo[b,e][1,4]dioxepine-7-carboxylate
TypeSmall organic molecule
Emp. Form.C26H30O8
Mol. Mass.470.5116
SMILESCCCCCc1c2Oc3cc(OC)cc(C(=O)CCCC)c3C(=O)Oc2cc(O)c1C(=O)OC