Reaction Details
TargetMethionine aminopeptidase 2
LigandBDBM17446
Substrate/Competitorn/a
Meas. Tech.ChEMBL_576148 (CHEMBL1027137)
IC50 1±n/a nM
Citation Sashidhara, KVWhite, KNCrews, P A selective account of effective paradigms and significant outcomes in the discovery of inspirational marine natural products. J Nat Prod72:588-603 (2010) 
 
Methionine aminopeptidase 2
Name:Methionine aminopeptidase 2
Type:Enzyme
Mol. Mass.:52884.45
Organism:Homo sapiens (Human)
Description:P50579
Residue:478
BDBM17446
NameBDBM17446
Synonyms:(3R,4S,5S,6R)-5-methoxy-4-[(2R,3R)-2-methyl-3-(3-methylbut-2-en-1-yl)oxiran-2-yl]-1-oxaspiro[2.5]octan-6-yl N-(2-chloroacetyl)carbamate TNP-470
TypeSmall organic molecule
Emp. Form.C19H28ClNO6
Mol. Mass.401.882
SMILES[H][C@@]1([#6@H](-[#8]-[#6])-[#6@@H](-[#6]-[#6][C@]11[#6]-[#8]1)-[#8]-[#6](=O)-[#7]-[#6](=O)-[#6]Cl)[C@@]1([#6])[#8]-[#6@@H]1-[#6]\[#6]=[#6](\[#6])-[#6]