Reaction Details
TargetMethionine aminopeptidase 2
LigandBDBM50295173
Substrate/Competitorn/a
Meas. Tech.ChEMBL_576148 (CHEMBL1027137)
IC50>50000±n/a nM
Citation Sashidhara, KVWhite, KNCrews, P A selective account of effective paradigms and significant outcomes in the discovery of inspirational marine natural products. J Nat Prod72:588-603 (2010) 
 
Methionine aminopeptidase 2
Name:Methionine aminopeptidase 2
Type:Enzyme
Mol. Mass.:52884.45
Organism:Homo sapiens (Human)
Description:P50579
Residue:478
BDBM50295173
NameBDBM50295173
Synonyms:Bengamide O | CHEMBL539894
TypeSmall organic molecule
Emp. Form.C33H60N2O8
Mol. Mass.612.8381
SMILESCCC(C)CCCCCCCCCCC(=O)O[C@H]1CC[C@H](NC(=O)[C@H](OC)[C@H](O)[C@@H](O)[C@H](O)\C=C\C(C)C)C(=O)N(C)C1