Reaction Details
TargetSigma non-opioid intracellular receptor 1
LigandBDBM50248926
Substrate/Competitorn/a
Meas. Tech.ChEMBL_578681 (CHEMBL1063062)
Ki 0.098±n/a nM
Citation Zampieri, DMamolo, MGLaurini, EFlorio, CZanette, CFermeglia, MPosocco, PPaneni, MSPricl, SVio, L Synthesis, biological evaluation, and three-dimensional in silico pharmacophore model for sigma(1) receptor ligands based on a series of substituted benzo[d]oxazol-2(3H)-one derivatives. J Med Chem52:5380-93 (2009) 
 
Sigma non-opioid intracellular receptor 1
Name:Sigma non-opioid intracellular receptor 1
Type:Enzyme Catalytic Domain
Mol. Mass.:25266.54
Organism:RAT
Description:Q9R0C9
Residue:223
BDBM50248926
NameBDBM50248926
Synonyms:3-((1-(4-chlorobenzyl)piperidin-4-yl)methyl)benzo[d]oxazol-2(3H)-one CHEMBL473783
TypeSmall organic molecule
Emp. Form.C20H21ClN2O2
Mol. Mass.356.846
SMILESClc1ccc(CN2CCC(Cn3c4ccccc4oc3=O)CC2)cc1