Reaction Details
TargetNitric oxide synthase, endothelial
LigandBDBM50295569
Substrate/Competitorn/a
Meas. Tech.ChEMBL_579935 (CHEMBL1056368)
IC50 188000±n/a nM
Citation Bluhm, UBoucher, JLBuss, UClement, BFriedrich, FGirreser, UHeber, DLam, TLepoivre, MRostaie-Gerylow, MWolschendorf, U Synthesis and evaluation of pyrido[1,2-a]pyrimidines as inhibitors of nitric oxide synthases. Eur J Med Chem44:2877-87 (2009) 
 
Nitric oxide synthase, endothelial
Name:Nitric oxide synthase, endothelial
Type:Enzyme
Mol. Mass.:133292.26
Organism:Bos taurus (bovine)
Description:Recombinant eNOS overexpressed in E. coli was used in enzyme assays.
Residue:1205
BDBM50295569
NameBDBM50295569
Synonyms:3-[4'-(4''-Bromophenyl)benzoyl]-3,4-dihydro-6,8-dimethyl-2Hpyrido[1,2-a]pyrimidine perchlorate | CHEMBL556316
TypeSmall organic molecule
Emp. Form.C23H22BrN2O
Mol. Mass.422.337
SMILESCc1cc(C)n2CC(CN[c+]2c1)C(=O)c1ccc(cc1)-c1ccc(Br)cc1