Reaction Details
TargetNitric oxide synthase, inducible
LigandBDBM50209245
Substrate/Competitorn/a
Meas. Tech.ChEMBL_579933 (CHEMBL1056366)
IC50 40000±n/a nM
Citation Bluhm, UBoucher, JLBuss, UClement, BFriedrich, FGirreser, UHeber, DLam, TLepoivre, MRostaie-Gerylow, MWolschendorf, U Synthesis and evaluation of pyrido[1,2-a]pyrimidines as inhibitors of nitric oxide synthases. Eur J Med Chem44:2877-87 (2009) 
 
Nitric oxide synthase, inducible
Name:Nitric oxide synthase, inducible
Type:Enzyme
Mol. Mass.:130595.79
Organism:Mus musculus (mouse)
Description:Recombinant enzyme overexpressed in E. coli.
Residue:1144
BDBM50209245
NameBDBM50209245
Synonyms:CHEMBL247378
TypeSmall organic molecule
Emp. Form.C7H5N3O2
Mol. Mass.163.1335
SMILES[O-][N+](=O)c1cccc2cn[nH]c12