Reaction Details
TargetCannabinoid receptor 1
LigandBDBM50296150
Substrate/Competitorn/a
Meas. Tech.ChEMBL_579533 (CHEMBL1059680)
Ki 520±n/a nM
Citation Foloppe, NBenwell, KBrooks, TDKennett, GKnight, ARMisra, AMonck, NJ Discovery and functional evaluation of diverse novel human CB(1) receptor ligands. Bioorg Med Chem Lett19:4183-90 (2009) 
 
Cannabinoid receptor 1
Name:Cannabinoid receptor 1
Type:G Protein-Coupled Receptor (GPCR)
Mol. Mass.:52868.96
Organism:Homo sapiens (Human)
Description:P21554
Residue:472
BDBM50296150
NameBDBM50296150
Synonyms:2-(1-(4-(4-chlorophenyl)-2,2,4-trimethyl-3,4-dihydroquinolin-1(2H)-yl)-1-oxopropan-2-yl)hexahydro-1H-isoindole-1,3(2H)-dione | CHEMBL563400
TypeSmall organic molecule
Emp. Form.C29H33ClN2O3
Mol. Mass.493.037
SMILESCC(N1C(=O)C2CCCCC2C1=O)C(=O)N1c2ccccc2C(C)(CC1(C)C)c1ccc(Cl)cc1