Reaction Details
TargetCannabinoid receptor 1
LigandBDBM50296158
Substrate/Competitorn/a
Meas. Tech.ChEMBL_579533 (CHEMBL1059680)
Ki 1606±n/a nM
Citation Foloppe, NBenwell, KBrooks, TDKennett, GKnight, ARMisra, AMonck, NJ Discovery and functional evaluation of diverse novel human CB(1) receptor ligands. Bioorg Med Chem Lett19:4183-90 (2009) 
 
Cannabinoid receptor 1
Name:Cannabinoid receptor 1
Type:G Protein-Coupled Receptor (GPCR)
Mol. Mass.:52868.96
Organism:Homo sapiens (Human)
Description:P21554
Residue:472
BDBM50296158
NameBDBM50296158
Synonyms:CHEMBL555873 | methyl 4-(4-(9H-fluoren-9-yl)piperazin-1-ylsulfonyl)-2,5-dimethylfuran-3-carboxylate
TypeSmall organic molecule
Emp. Form.C25H26N2O5S
Mol. Mass.466.549
SMILESCOC(=O)c1c(C)oc(C)c1S(=O)(=O)N1CCN(CC1)C1c2ccccc2-c2ccccc12