Reaction Details
TargetCannabinoid receptor 1
LigandBDBM50296165
Substrate/Competitorn/a
Meas. Tech.ChEMBL_579533 (CHEMBL1059680)
Ki 2593±n/a nM
Citation Foloppe, NBenwell, KBrooks, TDKennett, GKnight, ARMisra, AMonck, NJ Discovery and functional evaluation of diverse novel human CB(1) receptor ligands. Bioorg Med Chem Lett19:4183-90 (2009) 
 
Cannabinoid receptor 1
Name:Cannabinoid receptor 1
Type:G Protein-Coupled Receptor (GPCR)
Mol. Mass.:52868.96
Organism:Homo sapiens (Human)
Description:P21554
Residue:472
BDBM50296165
NameBDBM50296165
Synonyms:CHEMBL564343 | N-isopropyl-N-(2-(4-(4-methoxyphenyl)-6,7-dihydrothieno[3,2-c]pyridin-5(4H)-yl)-2-oxoethyl)cyclohexanecarboxamide
TypeSmall organic molecule
Emp. Form.C26H34N2O3S
Mol. Mass.454.625
SMILESCOc1ccc(cc1)C1N(CCc2sccc12)C(=O)CN(C(C)C)C(=O)C1CCCCC1